[Date Prev][Date Next][Thread Prev][Thread Next][Date Index][Thread Index]

[Momonga-users.ja:00545] Re: rpm のrebuildオ プション



中井です。

On Mon, 4 May 2009 23:54:55 +0900
leon <momonga@xxxxxxxxxxxxx> wrote:

> 同じくvineサイトから
> gtkimageview-1.3.0-0vl1.src.rpm を入手し rebuile 、
> gtkimageview, gtkimageview-devel を無事インストールしました。
> 
> 以下、ufraw-0.12.1-0vl1.src.rpm の rebuile 結果です。
> 
> $ sudo rpmbuild --rebuild ufraw-0.12.1-0vl1.src.rpm 
> ufraw-0.12.1-0vl1.src.rpm をインストール中です。
> 警告: InstallSourcePackage: ヘッダ V3 DSA signature: NOKEY, key ID 53233490
> 実行中(%prep): /bin/sh -e /var/tmp/rpm-tmp.26550
> + umask 022
> + cd /usr/src/momonga/BUILD
> (snap)
> ufraw_exiv2.cc: In function ‘int ufraw_exif_from_exiv2(ufraw_data*)’:
> ufraw_exiv2.cc:74: error: ‘class Exiv2::ExifData’ has no member named ‘copy’
> ufraw_exiv2.cc:84: error: ‘class Exiv2::ExifData’ has no member named ‘copy’
> ufraw_exiv2.cc:88: error: ‘class Exiv2::ExifData’ has no member named ‘eraseThumbnail’
> ufraw_exiv2.cc:92: error: ‘class Exiv2::ExifData’ has no member named ‘copy’
> make[2]: *** [ufraw_exiv2.o] エラー 1
> make[2]: ディレクトリ `/usr/src/momonga/BUILD/ufraw-0.12.1' から出ます
> make[1]: *** [all-recursive] エラー 1
> make[1]: ディレクトリ `/usr/src/momonga/BUILD/ufraw-0.12.1' から出ます
> make: *** [all] エラー 2
> エラー: /var/tmp/rpm-tmp.1387 の不正な終了ステータス (%build)
> 
Vine の ufraw が古すぎて、Momonga Linux 5 の exiv2 に対応していない様に見えます。
trunk には ufraw のパッケージがあるので

http://dist.momonga-linux.org/pub/momonga/development/SRPMS/

ここ、またはミラーから、

libgtkimageview-1.6.3-1m.mo5.src.rpm
ufraw-0.14.1-2m.mo5.nosrc.rpm

を落として、ビルドすることをお勧めします。

-- 
Ichiro Nakai
ichiro@xxxxxxxxxxxxx